Reaction Details
TargetHigh affinity cAMP-specific 3',5'-cyclic phosphodiesterase 7A
LigandBDBM50381301
Substrate/Competitorn/a
Meas. Tech.ChEMBL_814419 (CHEMBL2019815)
IC50 66±n/a nM
Citation Banerjee, AYadav, PSBajpai, MSangana, RRGullapalli, SGudi, GSGharat, LA Isothiazole and isoxazole fused pyrimidones as PDE7 inhibitors: SAR and pharmacokinetic evaluation. Bioorg Med Chem Lett22:3223-8 (2012) 
 
High affinity cAMP-specific 3',5'-cyclic phosphodiesterase 7A
Name:High affinity cAMP-specific 3',5'-cyclic phosphodiesterase 7A
Type:Enzyme
Mol. Mass.:55514.96
Organism:Homo sapiens (Human)
Description:Q13946
Residue:482
BDBM50381301
NameBDBM50381301
Synonyms:CHEMBL2019114
TypeSmall organic molecule
Emp. Form.C23H29N5O4S2
Mol. Mass.503.637
SMILESCOc1cc(ccc1-c1nc2snc(C3CCCCC3)c2c(=O)[nH]1)N1CCN(CC1)S(C)(=O)=O