Reaction Details
TargetHigh affinity cAMP-specific 3',5'-cyclic phosphodiesterase 7A
LigandBDBM50381314
Substrate/Competitorn/a
Meas. Tech.ChEMBL_814419 (CHEMBL2019815)
IC50 80±n/a nM
Citation Banerjee, AYadav, PSBajpai, MSangana, RRGullapalli, SGudi, GSGharat, LA Isothiazole and isoxazole fused pyrimidones as PDE7 inhibitors: SAR and pharmacokinetic evaluation. Bioorg Med Chem Lett22:3223-8 (2012) 
 
High affinity cAMP-specific 3',5'-cyclic phosphodiesterase 7A
Name:High affinity cAMP-specific 3',5'-cyclic phosphodiesterase 7A
Type:Enzyme
Mol. Mass.:55514.96
Organism:Homo sapiens (Human)
Description:Q13946
Residue:482
BDBM50381314
NameBDBM50381314
Synonyms:CHEMBL2019131
TypeSmall organic molecule
Emp. Form.C18H13ClN4O2S
Mol. Mass.384.839
SMILESCOc1cc(N)ccc1-c1nc2snc(-c3ccccc3Cl)c2c(=O)[nH]1