Reaction Details
TargetPhosphatidylinositol 4,5-bisphosphate 3-kinase catalytic subunit delta isoform
LigandBDBM12915
Substrate/Competitorn/a
Meas. Tech.ChEMBL_814717 (CHEMBL2021236)
IC50 570±n/a nM
Citation Zhang, ZMZhang, XWZhao, ZZYan, RXu, RGong, HBZhu, HL Synthesis, biological evaluation and molecular docking studies of 1,3,4-oxadiazole derivatives as potential immunosuppressive agents. Bioorg Med Chem20:3359-67 (2012) 
 
Phosphatidylinositol 4,5-bisphosphate 3-kinase catalytic subunit delta isoform
Name:Phosphatidylinositol 4,5-bisphosphate 3-kinase catalytic subunit delta isoform
Type:Enzyme Subunit
Mol. Mass.:119489.41
Organism:Homo sapiens (Human)
Description:O00329
Residue:1044
BDBM12915
NameBDBM12915
Synonyms:2-(4-Morpholinyl)-8-phenyl-4H-1-benzopyran-4-one CHEMBL98350 US10308662, Compound LY294002 | US9505780, LY294002
TypeSmall organic molecule
Emp. Form.C19H17NO3
Mol. Mass.307.3432
SMILESO=c1cc(oc2c(cccc12)-c1ccccc1)N1CCOCC1