Reaction Details
TargetHexokinase-4
LigandBDBM50381609
Substrate/Competitorn/a
Meas. Tech.ChEMBL_815664 (CHEMBL2025594)
EC50 28.3±n/a nM
Citation Mao, WNing, MLiu, ZZhu, QLeng, YZhang, A Design, synthesis, and pharmacological evaluation of benzamide derivatives as glucokinase activators. Bioorg Med Chem20:2982-91 (2012) 
 
Hexokinase-4
Name:Hexokinase-4
Type:Enzyme
Mol. Mass.:52175.81
Organism:Homo sapiens (Human)
Description:P35557
Residue:465
BDBM50381609
NameBDBM50381609
Synonyms:CHEMBL2022798
TypeSmall organic molecule
Emp. Form.C24H24N2O5S2
Mol. Mass.484.588
SMILES[#6]\[#6](-[#6])=[#6]\[#6]-[#8]-c1cc(-[#8]-c2ccc(cc2)S(=O)(=O)[#6]-2-[#6]-[#6]-2)cc(c1)-[#6](=O)-[#7]-c1nccs1