Reaction Details
TargetKappa-type opioid receptor
LigandBDBM50381667
Substrate/Competitorn/a
Meas. Tech.ChEMBL_816180 (CHEMBL2026564)
EC50 1370±n/a nM
Citation Lovell, KMVasiljevik, TAraya, JJLozama, APrevatt-Smith, KMDay, VWDersch, CMRothman, RBButelman, ERKreek, MJPrisinzano, TE Semisynthetic neoclerodanes as kappa opioid receptor probes. Bioorg Med Chem20:3100-10 (2012) 
 
Kappa-type opioid receptor
Name:Kappa-type opioid receptor
Type:G Protein-Coupled Receptor (GPCR)
Mol. Mass.:42648.76
Organism:Homo sapiens (Human)
Description:P41145
Residue:380
BDBM50381667
NameBDBM50381667
Synonyms:CHEMBL2022018
TypeSmall organic molecule
Emp. Form.C25H30O8
Mol. Mass.458.5009
SMILESCOC(=O)[C@@H]1C[C@H](OC(C)=O)C(=O)[C@H]2[C@@]1(C)CC[C@H]1C(=O)O[C@@H](C[C@]21C)\C=C/c1ccoc1