Reaction Details
TargetMu-type opioid receptor
LigandBDBM50381660
Substrate/Competitorn/a
Meas. Tech.ChEMBL_816181 (CHEMBL2026565)
Ki 9800±n/a nM
Citation Lovell, KMVasiljevik, TAraya, JJLozama, APrevatt-Smith, KMDay, VWDersch, CMRothman, RBButelman, ERKreek, MJPrisinzano, TE Semisynthetic neoclerodanes as kappa opioid receptor probes. Bioorg Med Chem20:3100-10 (2012) 
 
Mu-type opioid receptor
Name:Mu-type opioid receptor
Type:G Protein-Coupled Receptor (GPCR)
Mol. Mass.:44789.51
Organism:Homo sapiens (Human)
Description:P35372
Residue:400
BDBM50381660
NameBDBM50381660
Synonyms:CHEMBL2022300
TypeSmall organic molecule
Emp. Form.C24H28O9
Mol. Mass.460.4737
SMILESCOC(=O)[C@@H]1C[C@H](OC(C)=O)C(=O)[C@H]2[C@@]1(C)CC[C@H]1C(=O)O[C@@H](C[C@]21C)C(=O)c1ccco1