Reaction Details
TargetMu-type opioid receptor
LigandBDBM50381667
Substrate/Competitorn/a
Meas. Tech.ChEMBL_816181 (CHEMBL2026565)
Ki 2600±n/a nM
Citation Lovell, KMVasiljevik, TAraya, JJLozama, APrevatt-Smith, KMDay, VWDersch, CMRothman, RBButelman, ERKreek, MJPrisinzano, TE Semisynthetic neoclerodanes as kappa opioid receptor probes. Bioorg Med Chem20:3100-10 (2012) 
 
Mu-type opioid receptor
Name:Mu-type opioid receptor
Type:G Protein-Coupled Receptor (GPCR)
Mol. Mass.:44789.51
Organism:Homo sapiens (Human)
Description:P35372
Residue:400
BDBM50381667
NameBDBM50381667
Synonyms:CHEMBL2022018
TypeSmall organic molecule
Emp. Form.C25H30O8
Mol. Mass.458.5009
SMILESCOC(=O)[C@@H]1C[C@H](OC(C)=O)C(=O)[C@H]2[C@@]1(C)CC[C@H]1C(=O)O[C@@H](C[C@]21C)\C=C/c1ccoc1