Reaction Details
TargetKappa-type opioid receptor
LigandBDBM50381672
Substrate/Competitorn/a
Meas. Tech.ChEMBL_816187 (CHEMBL2026571)
Ki 500±n/a nM
Citation Lovell, KMVasiljevik, TAraya, JJLozama, APrevatt-Smith, KMDay, VWDersch, CMRothman, RBButelman, ERKreek, MJPrisinzano, TE Semisynthetic neoclerodanes as kappa opioid receptor probes. Bioorg Med Chem20:3100-10 (2012) 
 
Kappa-type opioid receptor
Name:Kappa-type opioid receptor
Type:G Protein-Coupled Receptor (GPCR)
Mol. Mass.:42648.76
Organism:Homo sapiens (Human)
Description:P41145
Residue:380
BDBM50381672
NameBDBM50381672
Synonyms:CHEMBL2022293
TypeSmall organic molecule
Emp. Form.C26H30O9
Mol. Mass.486.511
SMILESCOC(=O)[C@@H]1C[C@H](OC(C)=O)C(=O)[C@H]2[C@@]1(C)CC[C@H]1C(=O)O[C@@H](C[C@]21C)C(=O)c1ccccc1O