Reaction Details
TargetDipeptidyl peptidase 9
LigandBDBM50381855
Substrate/Competitorn/a
Meas. Tech.ChEMBL_816820 (CHEMBL2026012)
IC50>10000±n/a nM
Citation Xie, HZeng, LZeng, SLu, XZhang, GZhao, XCheng, NTu, ZLi, ZXu, HYang, LZhang, XHuang, MZhao, JHu, W Novel pyrrolopyrimidine analogues as potent dipeptidyl peptidase IV inhibitors based on pharmacokinetic property-driven optimization. Eur J Med Chem52:205-12 (2012) 
 
Dipeptidyl peptidase 9
Name:Dipeptidyl peptidase 9
Type:Enzyme
Mol. Mass.:98260.70
Organism:Homo sapiens (Human)
Description:Q86TI2
Residue:863
BDBM50381855
NameBDBM50381855
Synonyms:CHEMBL2023066
TypeSmall organic molecule
Emp. Form.C24H23N7O
Mol. Mass.425.4857
SMILESN[C@@H]1CCCN(C1)c1nc2[nH]c(cc2c(=O)n1Cc1ccccc1C#N)-c1cccnc1