Reaction Details
TargetDipeptidyl peptidase 8
LigandBDBM16285
Substrate/Competitorn/a
Meas. Tech.ChEMBL_816819 (CHEMBL2026011)
IC50>25000±n/a nM
Citation Xie, HZeng, LZeng, SLu, XZhang, GZhao, XCheng, NTu, ZLi, ZXu, HYang, LZhang, XHuang, MZhao, JHu, W Novel pyrrolopyrimidine analogues as potent dipeptidyl peptidase IV inhibitors based on pharmacokinetic property-driven optimization. Eur J Med Chem52:205-12 (2012) 
 
Dipeptidyl peptidase 8
Name:Dipeptidyl peptidase 8
Type:Enzyme
Mol. Mass.:103342.62
Organism:Homo sapiens (Human)
Description:Q6V1X1
Residue:898
BDBM16285
NameBDBM16285
Synonyms:2-({6-[(3R)-3-aminopiperidin-1-yl]-3-methyl-2,4-dioxo-1,2,3,4-tetrahydropyrimidin-1-yl}methyl)benzonitrile Alogliptin | SYR-322
TypeSmall organic molecule
Emp. Form.C18H21N5O2
Mol. Mass.339.3916
SMILESCn1c(=O)cc(N2CCC[C@@H](N)C2)n(Cc2ccccc2C#N)c1=O