Reaction Details
TargetDipeptidyl peptidase 9
LigandBDBM50381856
Substrate/Competitorn/a
Meas. Tech.ChEMBL_816820 (CHEMBL2026012)
IC50>25000±n/a nM
Citation Xie, HZeng, LZeng, SLu, XZhang, GZhao, XCheng, NTu, ZLi, ZXu, HYang, LZhang, XHuang, MZhao, JHu, W Novel pyrrolopyrimidine analogues as potent dipeptidyl peptidase IV inhibitors based on pharmacokinetic property-driven optimization. Eur J Med Chem52:205-12 (2012) 
 
Dipeptidyl peptidase 9
Name:Dipeptidyl peptidase 9
Type:Enzyme
Mol. Mass.:98260.70
Organism:Homo sapiens (Human)
Description:Q86TI2
Residue:863
BDBM50381856
NameBDBM50381856
Synonyms:CHEMBL2022464
TypeSmall organic molecule
Emp. Form.C20H22N6O
Mol. Mass.362.4283
SMILESCc1cc2c(nc(N3CCC[C@@H](N)C3)n(Cc3ccccc3C#N)c2=O)[nH]1