Reaction Details
TargetSphingosine 1-phosphate receptor 1
LigandBDBM50381894
Substrate/Competitorn/a
Meas. Tech.ChEMBL_817708 (CHEMBL2027356)
EC50 11±n/a nM
Citation Asano, MNakamura, TSekiguchi, YMizuno, YYamaguchi, TTamaki, KShimozato, TDoi-Komuro, HKagari, TTomisato, WInoue, RYuita, HOguchi-Oshima, KKaneko, RNara, FKawase, YMasubuchi, NNakayama, SKoga, TNamba, ENasu, HNishi, T Synthesis and SAR of 1,3-thiazolyl thiophene and pyridine derivatives as potent, orally active and S1P3-sparing S1P1 agonists. Bioorg Med Chem Lett22:3083-8 (2012) 
 
Sphingosine 1-phosphate receptor 1
Name:Sphingosine 1-phosphate receptor 1
Type:Enzyme
Mol. Mass.:42836.02
Organism:Homo sapiens (Human)
Description:P21453
Residue:382
BDBM50381894
NameBDBM50381894
Synonyms:CHEMBL2022912
TypeSmall organic molecule
Emp. Form.C24H28N2O3S2
Mol. Mass.456.621
SMILESCCc1cc(CN2CC(C2)C(O)=O)sc1-c1cnc(s1)-c1ccc(OC(C)C)c(C)c1