Reaction Details
TargetSphingosine 1-phosphate receptor 3
LigandBDBM50381906
Substrate/Competitorn/a
Meas. Tech.ChEMBL_817709 (CHEMBL2027357)
EC50>20000±n/a nM
Citation Asano, MNakamura, TSekiguchi, YMizuno, YYamaguchi, TTamaki, KShimozato, TDoi-Komuro, HKagari, TTomisato, WInoue, RYuita, HOguchi-Oshima, KKaneko, RNara, FKawase, YMasubuchi, NNakayama, SKoga, TNamba, ENasu, HNishi, T Synthesis and SAR of 1,3-thiazolyl thiophene and pyridine derivatives as potent, orally active and S1P3-sparing S1P1 agonists. Bioorg Med Chem Lett22:3083-8 (2012) 
 
Sphingosine 1-phosphate receptor 3
Name:Sphingosine 1-phosphate receptor 3
Type:G Protein-Coupled Receptor (GPCR)
Mol. Mass.:42278.13
Organism:Homo sapiens (Human)
Description:Q99500
Residue:378
BDBM50381906
NameBDBM50381906
Synonyms:CHEMBL2022706
TypeSmall organic molecule
Emp. Form.C26H24N2O4S
Mol. Mass.460.545
SMILESCCc1cc(CN2CC(C2)C(O)=O)sc1-c1cc(on1)-c1ccc(Oc2ccccc2)cc1