Reaction Details
TargetAcetylcholinesterase
LigandBDBM50381952
Substrate/Competitorn/a
Meas. Tech.ChEMBL_814866 (CHEMBL2026608)
Ki 65±n/a nM
Citation Samadi, Ade los Ríos, CBolea, IChioua, MIriepa, IMoraleda, IBartolini, MAndrisano, VGálvez, EValderas, CUnzeta, MMarco-Contelles, J Multipotent MAO and cholinesterase inhibitors for the treatment of Alzheimer's disease: synthesis, pharmacological analysis and molecular modeling of heterocyclic substituted alkyl and cycloalkyl propargyl amine. Eur J Med Chem52:251-62 (2012) 
 
Acetylcholinesterase
Name:Acetylcholinesterase
Type:Enzyme
Mol. Mass.:71812.79
Organism:Electrophorus electricus (Electric eel)
Description:n/a
Residue:633
BDBM50381952
NameBDBM50381952
Synonyms:CHEMBL2022933
TypeSmall organic molecule
Emp. Form.C19H20N6
Mol. Mass.332.4023
SMILESNc1c2CN(CC#C)CCc2nc2nc(N3CCCC3)c(cc12)C#N