Reaction Details
TargetCholinesterase
LigandBDBM50381952
Substrate/Competitorn/a
Meas. Tech.ChEMBL_814863 (CHEMBL2026605)
IC50 82000±n/a nM
Citation Samadi, Ade los Ríos, CBolea, IChioua, MIriepa, IMoraleda, IBartolini, MAndrisano, VGálvez, EValderas, CUnzeta, MMarco-Contelles, J Multipotent MAO and cholinesterase inhibitors for the treatment of Alzheimer's disease: synthesis, pharmacological analysis and molecular modeling of heterocyclic substituted alkyl and cycloalkyl propargyl amine. Eur J Med Chem52:251-62 (2012) 
 
Cholinesterase
Name:Cholinesterase
Type:Homotetramer
Mol. Mass.:68422.27
Organism:Homo sapiens (Human)
Description:P06276
Residue:602
BDBM50381952
NameBDBM50381952
Synonyms:CHEMBL2022933
TypeSmall organic molecule
Emp. Form.C19H20N6
Mol. Mass.332.4023
SMILESNc1c2CN(CC#C)CCc2nc2nc(N3CCCC3)c(cc12)C#N