Reaction Details
TargetCarboxylic ester hydrolase
LigandBDBM50381961
Substrate/Competitorn/a
Meas. Tech.ChEMBL_815076 (CHEMBL2024801)
IC50 7000±n/a nM
Citation Samadi, Ade los Ríos, CBolea, IChioua, MIriepa, IMoraleda, IBartolini, MAndrisano, VGálvez, EValderas, CUnzeta, MMarco-Contelles, J Multipotent MAO and cholinesterase inhibitors for the treatment of Alzheimer's disease: synthesis, pharmacological analysis and molecular modeling of heterocyclic substituted alkyl and cycloalkyl propargyl amine. Eur J Med Chem52:251-62 (2012) 
 
Carboxylic ester hydrolase
Name:Carboxylic ester hydrolase
Type:Protein
Mol. Mass.:68842.83
Organism:Equus caballus (Horse)
Description:Q9N1N9
Residue:602
BDBM50381961
NameBDBM50381961
Synonyms:CHEMBL2022928
TypeSmall organic molecule
Emp. Form.C21H22N2O
Mol. Mass.318.4122
SMILESCC#CCN(C)Cc1cc2cc(OCc3ccccc3)ccc2[nH]1