Reaction Details
TargetAmine oxidase [flavin-containing] B
LigandBDBM50381961
Substrate/Competitorn/a
Meas. Tech.ChEMBL_814867 (CHEMBL2026609)
IC50 31±n/a nM
Citation Samadi, Ade los Ríos, CBolea, IChioua, MIriepa, IMoraleda, IBartolini, MAndrisano, VGálvez, EValderas, CUnzeta, MMarco-Contelles, J Multipotent MAO and cholinesterase inhibitors for the treatment of Alzheimer's disease: synthesis, pharmacological analysis and molecular modeling of heterocyclic substituted alkyl and cycloalkyl propargyl amine. Eur J Med Chem52:251-62 (2012) 
 
Amine oxidase [flavin-containing] B
Name:Amine oxidase [flavin-containing] B
Type:Enzyme
Mol. Mass.:58469.65
Organism:Rattus norvegicus (rat)
Description:P19643
Residue:520
BDBM50381961
NameBDBM50381961
Synonyms:CHEMBL2022928
TypeSmall organic molecule
Emp. Form.C21H22N2O
Mol. Mass.318.4122
SMILESCC#CCN(C)Cc1cc2cc(OCc3ccccc3)ccc2[nH]1