Reaction Details
TargetProstaglandin G/H synthase 2
LigandBDBM50382191
Substrate/Competitorn/a
Meas. Tech.ChEMBL_817254 (CHEMBL2025554)
IC50 1390±n/a nM
Citation Smith, BChang, HHMedda, FGokhale, VDietrich, JDavis, AMeuillet, EJHulme, C Synthesis and biological activity of 2-aminothiazoles as novel inhibitors of PGE2 production in cells. Bioorg Med Chem Lett22:3567-70 (2012) 
 
Prostaglandin G/H synthase 2
Name:Prostaglandin G/H synthase 2
Type:Enzyme
Mol. Mass.:69003.89
Organism:Homo sapiens (Human)
Description:Recombinant Cox-2 provided by Cayman (Cayman Chemical Co.,Ann Arbor, MI).
Residue:604
BDBM50382191
NameBDBM50382191
Synonyms:CHEMBL2023848
TypeSmall organic molecule
Emp. Form.C16H13ClN2OS
Mol. Mass.316.805
SMILESCOc1cccc(Nc2nc(cs2)-c2ccc(Cl)cc2)c1