Reaction Details
TargetRho-associated protein kinase 2
LigandBDBM50005622
Substrate/Competitorn/a
Meas. Tech.ChEMBL_816447 (CHEMBL2024934)
IC50>31623±n/a nM
Citation Lavogina, DKalind, KBredihhina, JHurt, MVaasa, AKasari, MEnkvist, ERaidaru, GUri, A Conjugates of 5-isoquinolinesulfonylamides and oligo-D-arginine possess high affinity and selectivity towards Rho kinase (ROCK). Bioorg Med Chem Lett22:3425-30 (2012) 
 
Rho-associated protein kinase 2
Name:Rho-associated protein kinase 2
Type:Protein
Mol. Mass.:160885.43
Organism:Homo sapiens (Human)
Description:O75116
Residue:1388
BDBM50005622
NameBDBM50005622
Synonyms:CHEMBL2024651
TypeSmall organic molecule
Emp. Form.C42H70N16O9S
Mol. Mass.975.172
SMILESNCCCC[C@@H](NC(=O)CNC(=O)CNCC(=O)NCCNS(=O)(=O)c1cccc2cnccc12)C(=O)NCCCCCC(=O)N[C@H](CCCNC(N)=N)C(=O)N[C@H](CCCNC(N)=C)C(N)=O