Reaction Details
TargetRho-associated protein kinase 2
LigandBDBM50382220
Substrate/Competitorn/a
Meas. Tech.ChEMBL_816447 (CHEMBL2024934)
Kd 1200±n/a nM
Citation Lavogina, DKalind, KBredihhina, JHurt, MVaasa, AKasari, MEnkvist, ERaidaru, GUri, A Conjugates of 5-isoquinolinesulfonylamides and oligo-D-arginine possess high affinity and selectivity towards Rho kinase (ROCK). Bioorg Med Chem Lett22:3425-30 (2012) 
 
Rho-associated protein kinase 2
Name:Rho-associated protein kinase 2
Type:Protein
Mol. Mass.:160885.43
Organism:Homo sapiens (Human)
Description:O75116
Residue:1388
BDBM50382220
NameBDBM50382220
Synonyms:CHEMBL2024654
TypeSmall organic molecule
Emp. Form.C48H74N16O9S
Mol. Mass.1051.268
SMILES[#6]-[#6](-[#7])=[#7]-[#6]-[#6]-[#6]-[#6@@H](-[#7]-[#6](=O)-[#6@@H](-[#6]-[#6]-[#6]\[#7]=[#6](\[#7])-[#7])-[#7]-[#6](=O)-[#6]-[#6]-[#6]-[#6]-[#6]-[#7]-[#6](=O)-[#6@@H](-[#6]-[#6]-[#6]-[#6]-[#7])-[#7]-[#6](=O)-c1ccc(-[#6]-[#7]-[#6](=O)-[#6]-[#7]-[#6]-[#6](=O)-[#7]-[#6]-[#6]-[#7]S(=O)(=O)c2cccc3cnccc23)cc1)-[#6](-[#7])=O