Reaction Details
TargetRho-associated protein kinase 2
LigandBDBM50382221
Substrate/Competitorn/a
Meas. Tech.ChEMBL_816447 (CHEMBL2024934)
Kd 690±n/a nM
Citation Lavogina, DKalind, KBredihhina, JHurt, MVaasa, AKasari, MEnkvist, ERaidaru, GUri, A Conjugates of 5-isoquinolinesulfonylamides and oligo-D-arginine possess high affinity and selectivity towards Rho kinase (ROCK). Bioorg Med Chem Lett22:3425-30 (2012) 
 
Rho-associated protein kinase 2
Name:Rho-associated protein kinase 2
Type:Protein
Mol. Mass.:160885.43
Organism:Homo sapiens (Human)
Description:O75116
Residue:1388
BDBM50382221
NameBDBM50382221
Synonyms:CHEMBL2024655
TypeSmall organic molecule
Emp. Form.C39H66N16O8S
Mol. Mass.919.109
SMILES[#7]-[#6]-[#6]-[#6]-[#6]-[#6@H](-[#7]-[#6](=O)-[#6]-[#7]-[#6]-[#6](=O)-[#7]-[#6]-[#6]-[#7]S(=O)(=O)c1cccc2cnccc12)-[#6](=O)-[#7]-[#6]-[#6]-[#6]-[#6]-[#6]-[#6](=O)-[#7]-[#6@H](-[#6]-[#6]-[#6]\[#7]=[#6](\[#7])-[#7])-[#6](=O)-[#7]-[#6@H](-[#6]-[#6]-[#6]\[#7]=[#6](\[#7])-[#7])-[#6](-[#7])=O