Reaction Details
TargetRibosomal protein S6 kinase alpha-5
LigandBDBM50382224
Substrate/Competitorn/a
Meas. Tech.ChEMBL_816449 (CHEMBL2024936)
Kd 12±n/a nM
Citation Lavogina, DKalind, KBredihhina, JHurt, MVaasa, AKasari, MEnkvist, ERaidaru, GUri, A Conjugates of 5-isoquinolinesulfonylamides and oligo-D-arginine possess high affinity and selectivity towards Rho kinase (ROCK). Bioorg Med Chem Lett22:3425-30 (2012) 
 
Ribosomal protein S6 kinase alpha-5
Name:Ribosomal protein S6 kinase alpha-5
Type:Serine/threonine-protein kinase
Mol. Mass.:89874.44
Organism:Homo sapiens (Human)
Description:n/a
Residue:802
BDBM50382224
NameBDBM50382224
Synonyms:CHEMBL2023841
TypeSmall organic molecule
Emp. Form.C105H168N37O16S2
Mol. Mass.2268.825
SMILES[#6]C1([#6])[#6]-2=[#6]-3-[#6]=[#6]-4-[#6](-[#6]-[#6]-[#7+]-5=[#6]-4C([#6])([#6])c4cc(-[#6]-[#6](=O)-[#7]-[#6]-[#6]-[#6]-[#6]-[#6@@H](-[#7]-[#6](=O)-[#6@@H](-[#6]-[#6]-[#6]\[#7]=[#6](\[#7])-[#7])-[#7]-[#6](=O)-[#6@@H](-[#6]-[#6]-[#6]\[#7]=[#6](\[#7])-[#7])-[#7]-[#6](=O)-[#6@@H](-[#6]-[#6]-[#6]\[#7]=[#6](\[#7])-[#7])-[#7]-[#6](=O)-[#6@@H](-[#6]-[#6]-[#6]\[#7]=[#6](\[#7])-[#7])-[#7]-[#6](=O)-[#6@@H](-[#6]-[#6]-[#6]\[#7]=[#6](\[#7])-[#7])-[#7]-[#6](=O)-[#6@@H](-[#6]-[#6]-[#6]\[#7]=[#6](\[#7])-[#7])-[#7]-[#6](=O)-[#6]-[#6]-[#6]-[#6]-[#6]-[#7]-[#6](=O)-[#6@@H](-[#6]-[#6]-[#6]\[#7]=[#6](\[#7])-[#7])-[#7]-[#6](=O)-[#6]-[#6]-[#6]-[#6]-[#6]-[#6]-[#6]-[#7]-[#6]-[#6]-[#7]S(=O)(=O)c6cccc7cnccc67)-[#6](-[#7])=O)ccc-54)-[#8]-[#6]-3-[#6]-[#6]-[#7]-2-c2ccc(cc12)S([#6])(=O)=O