Reaction Details
TargetMitogen-activated protein kinase 14
LigandBDBM50099331
Substrate/Competitorn/a
Meas. Tech.ChEMBL_817829 (CHEMBL2027477)
Ki 60±n/a nM
Citation Duffy, JPHarrington, EMSalituro, FGCochran, JEGreen, JGao, HBemis, GWEvindar, GGalullo, VPFord, PJGermann, UAWilson, KPBellon, SFChen, GTaslimi, PJones, PHuang, CPazhanisamy, SWang, YMMurcko, MASu, MS The Discovery of VX-745: A Novel and Selective p38a Kinase Inhibitor. ACS Med Chem Lett2:758-763 (2011) 
 
Mitogen-activated protein kinase 14
Name:Mitogen-activated protein kinase 14
Type:Serine/threonine-protein kinase
Mol. Mass.:41286.76
Organism:Homo sapiens (Human)
Description:Q16539
Residue:360
BDBM50099331
NameBDBM50099331
Synonyms:4-(4-(4-fluorophenyl)-1-(piperidin-4-yl)-1H-imidazol-5-yl)pyridine CHEMBL279416 | VK-19911
TypeSmall organic molecule
Emp. Form.C19H19FN4
Mol. Mass.322.3794
SMILESFc1ccc(cc1)-c1ncn(C2CCNCC2)c1-c1ccncc1