Reaction Details
Target2-Hydroxyacid oxidase 2
LigandBDBM50382411
Substrate/Competitorn/a
Meas. Tech.ChEMBL_815422 (CHEMBL2027074)
IC50 4270±n/a nM
Citation Barawkar, DAMeru, ABandyopadhyay, ABanerjee, ADeshpande, AMAthare, CKoduru, CKhose, GGundu, JMahajan, KPatil, PKandalkar, SRNiranjan, SBhosale, SDe, SMukhopadhyay, SChaudhary, SKoul, SSingh, UChugh, APalle, VPMookhtiar, KAVacca, JChakravarty, PKNargund, RPWright, SDRoy, SGraziano, MPSingh, SBCully, DCai, TQ Potent and Selective Inhibitors of Long Chain l-2-Hydroxy Acid Oxidase Reduced Blood Pressure in DOCA Salt-Treated Rats. ACS Med Chem Lett2:919-923 (2011) 
 
2-Hydroxyacid oxidase 2
Name:2-Hydroxyacid oxidase 2
Type:PROTEIN
Mol. Mass.:39204.34
Organism:Rattus norvegicus
Description:ChEMBL_863190
Residue:353
BDBM50382411
NameBDBM50382411
Synonyms:CHEMBL2022569
TypeSmall organic molecule
Emp. Form.C13H14N2O2
Mol. Mass.230.2625
SMILESCc1[nH]nc(C(O)=O)c1CCc1ccccc1