Reaction Details
TargetCytochrome P450 1A2
LigandBDBM50382413
Substrate/Competitorn/a
Meas. Tech.ChEMBL_815430 (CHEMBL2027082)
IC50>10000±n/a nM
Citation Barawkar, DAMeru, ABandyopadhyay, ABanerjee, ADeshpande, AMAthare, CKoduru, CKhose, GGundu, JMahajan, KPatil, PKandalkar, SRNiranjan, SBhosale, SDe, SMukhopadhyay, SChaudhary, SKoul, SSingh, UChugh, APalle, VPMookhtiar, KAVacca, JChakravarty, PKNargund, RPWright, SDRoy, SGraziano, MPSingh, SBCully, DCai, TQ Potent and Selective Inhibitors of Long Chain l-2-Hydroxy Acid Oxidase Reduced Blood Pressure in DOCA Salt-Treated Rats. ACS Med Chem Lett2:919-923 (2011) 
 
Cytochrome P450 1A2
Name:Cytochrome P450 1A2
Type:Enzyme
Mol. Mass.:58423.38
Organism:Homo sapiens (Human)
Description:P05177
Residue:516
BDBM50382413
NameBDBM50382413
Synonyms:CHEMBL2022571
TypeSmall organic molecule
Emp. Form.C14H12N2O2S
Mol. Mass.272.322
SMILESCc1[nH]nc(C(O)=O)c1Cc1cc2ccccc2s1