Reaction Details
Target11-beta-hydroxysteroid dehydrogenase type 2
LigandBDBM50382822
Substrate/Competitorn/a
Meas. Tech.ChEMBL_815023 (CHEMBL2027169)
EC50>100000±n/a nM
Citation Zhang, LChen, JNing, MZou, QLeng, YShen, J Synthesis and evaluation of piperidine urea derivatives as efficacious 11ß-hydroxysteroid dehydrogenase type 1 inhibitors in diabetic ob/ob mice. Bioorg Med Chem Lett22:2748-52 (2012) 
 
11-beta-hydroxysteroid dehydrogenase type 2
Name:11-beta-hydroxysteroid dehydrogenase type 2
Type:Enzyme
Mol. Mass.:42201.46
Organism:Mus musculus (mouse)
Description:Purified recombinant mouse 11beta-HSD2.
Residue:386
BDBM50382822
NameBDBM50382822
Synonyms:CHEMBL2023587
TypeSmall organic molecule
Emp. Form.C25H33ClN4O4S
Mol. Mass.521.072
SMILESCN(C1C2CC3CC(C2)CC1C3)C(=O)N1CCC(CN2C(=O)Nc3ccc(Cl)cc3S2(=O)=O)CC1