Reaction Details
TargetC-C chemokine receptor type 2
LigandBDBM50382932
Substrate/Competitorn/a
Meas. Tech.ChEMBL_819964 (CHEMBL2032551)
IC50 0.5±n/a nM
Citation Xue, CBWang, AHan, QZhang, YCao, GFeng, HHuang, TZheng, CXia, MZhang, KKong, LGlenn, JAnand, RMeloni, DRobinson, DJShao, LStorace, LLi, MHughes, RODevraj, RMorton, PARogier, DJCovington, MScherle, PDiamond, SEmm, TYeleswaram, SContel, NVaddi, KNewton, RHollis, GMetcalf, B Discovery of INCB8761/PF-4136309, a Potent, Selective, and Orally Bioavailable CCR2 Antagonist. ACS Med Chem Lett2:913-918 (2011) 
 
C-C chemokine receptor type 2
Name:C-C chemokine receptor type 2
Type:Enzyme
Mol. Mass.:41932.32
Organism:Homo sapiens (Human)
Description:P41597
Residue:374
BDBM50382932
NameBDBM50382932
Synonyms:CHEMBL2029422
TypeSmall organic molecule
Emp. Form.C29H31F3N6O3
Mol. Mass.568.59
SMILESO[C@]1(CC[C@@H](CC1)N[C@H]1CCN(C1)C(=O)CNC(=O)c1cccc(c1)C(F)(F)F)c1ccc(cn1)-c1ncccn1