Reaction Details
TargetAdenosine receptor A2b
LigandBDBM50383010
Substrate/Competitorn/a
Meas. Tech.ChEMBL_818429 (CHEMBL2034749)
IC50 5.34±n/a nM
Citation Taliani, SPugliesi, IBarresi, ESimorini, FSalerno, SLa Motta, CMarini, AMCosimelli, BCosconati, SDi Maro, SMarinelli, LDaniele, STrincavelli, MLGreco, GNovellino, EMartini, CDa Settimo, F 3-aryl-[1,2,4]triazino[4,3-a]benzimidazol-4(10H)-one: a novel template for the design of highly selective A2B adenosine receptor antagonists. J Med Chem55:1490-9 (2012) 
 
Adenosine receptor A2b
Name:Adenosine receptor A2b
Type:G Protein-Coupled Receptor (GPCR)
Mol. Mass.:36341.22
Organism:Homo sapiens (Human)
Description:n/a
Residue:332
BDBM50383010
NameBDBM50383010
Synonyms:CHEMBL2030706
TypeSmall organic molecule
Emp. Form.C21H16N4O2
Mol. Mass.356.3773
SMILESO=c1c(nnc2n(CCc3ccccc3)c3ccccc3n12)-c1ccco1