Reaction Details
TargetAdenosine receptor A2a
LigandBDBM21173
Substrate/Competitorn/a
Meas. Tech.ChEMBL_818428 (CHEMBL2034748)
Ki 337±n/a nM
Citation Taliani, SPugliesi, IBarresi, ESimorini, FSalerno, SLa Motta, CMarini, AMCosimelli, BCosconati, SDi Maro, SMarinelli, LDaniele, STrincavelli, MLGreco, GNovellino, EMartini, CDa Settimo, F 3-aryl-[1,2,4]triazino[4,3-a]benzimidazol-4(10H)-one: a novel template for the design of highly selective A2B adenosine receptor antagonists. J Med Chem55:1490-9 (2012) 
 
Adenosine receptor A2a
Name:Adenosine receptor A2a
Type:G Protein-Coupled Receptor (GPCR)
Mol. Mass.:44716.46
Organism:Homo sapiens (Human)
Description:P29274
Residue:412
BDBM21173
NameBDBM21173
Synonyms:1,3-dipropyl-8-cyclopentylxanthine CHEMBL183 PD116948 | [3H]DPCPX
Typeradiolabeled ligand
Emp. Form.C16H24N4O2
Mol. Mass.304.3874
SMILESCCCn1c2nc([nH]c2c(=O)n(CCC)c1=O)C1CCCC1