Reaction Details
TargetLysosomal acid glucosylceramidase
LigandBDBM50383325
Substrate/Competitorn/a
Meas. Tech.ChEMBL_820004 (CHEMBL2032679)
pH5±n/a
Ki 4.4±n/a nM
Commentsextracted
Citation Goddard-Borger, EDTropak, MBYonekawa, STysoe, CMahuran, DJWithers, SG Rapid assembly of a library of lipophilic iminosugars via the thiol-ene reaction yields promising pharmacological chaperones for the treatment of Gaucher disease. J Med Chem55:2737-45 (2012) 
 
Lysosomal acid glucosylceramidase
Name:Lysosomal acid glucosylceramidase
Type:Enzyme
Mol. Mass.:59724.64
Organism:Homo sapiens (Human)
Description:The beta-Glu activity was measured with commercially available beta-glucocerebrosidase (Ceredase) as the enzyme source.
Residue:536
BDBM50383325
NameBDBM50383325
Synonyms:CHEMBL2029776
TypeSmall organic molecule
Emp. Form.C12H25NO3S
Mol. Mass.263.397
SMILESCC(C)CCSCC[C@H]1NC[C@@H](O)[C@H](O)[C@H]1O