Reaction Details
TargetCannabinoid receptor 1
LigandBDBM50383385
Substrate/Competitorn/a
Meas. Tech.ChEMBL_818077 (CHEMBL2033719)
Ki 187±n/a nM
Citation Fulp, ABortoff, KSeltzman, HZhang, YMathews, JSnyder, RFennell, TMaitra, R Design and synthesis of cannabinoid receptor 1 antagonists for peripheral selectivity. J Med Chem55:2820-34 (2012) 
 
Cannabinoid receptor 1
Name:Cannabinoid receptor 1
Type:G Protein-Coupled Receptor (GPCR)
Mol. Mass.:52868.96
Organism:Homo sapiens (Human)
Description:P21554
Residue:472
BDBM50383385
NameBDBM50383385
Synonyms:CHEMBL2030764
TypeSmall organic molecule
Emp. Form.C27H30Cl3N5O2
Mol. Mass.562.918
SMILESCCCCNC(=O)N1CCC(CC1)NC(=O)c1nn(c(c1C)-c1ccc(Cl)cc1)-c1ccc(Cl)cc1Cl