Reaction Details
TargetCannabinoid receptor 1
LigandBDBM50383391
Substrate/Competitorn/a
Meas. Tech.ChEMBL_818077 (CHEMBL2033719)
Ki 62.6±n/a nM
Citation Fulp, ABortoff, KSeltzman, HZhang, YMathews, JSnyder, RFennell, TMaitra, R Design and synthesis of cannabinoid receptor 1 antagonists for peripheral selectivity. J Med Chem55:2820-34 (2012) 
 
Cannabinoid receptor 1
Name:Cannabinoid receptor 1
Type:G Protein-Coupled Receptor (GPCR)
Mol. Mass.:52868.96
Organism:Homo sapiens (Human)
Description:P21554
Residue:472
BDBM50383391
NameBDBM50383391
Synonyms:CHEMBL2030742
TypeSmall organic molecule
Emp. Form.C30H27Cl3N4O2
Mol. Mass.581.92
SMILESCC(=O)NC1(CCN(CC1)C(=O)c1nn(c(c1C)-c1ccc(Cl)cc1)-c1ccc(Cl)cc1Cl)c1ccccc1