Reaction Details
TargetCannabinoid receptor 2
LigandBDBM50383395
Substrate/Competitorn/a
Meas. Tech.ChEMBL_818078 (CHEMBL2033720)
Ki 16289±n/a nM
Citation Fulp, ABortoff, KSeltzman, HZhang, YMathews, JSnyder, RFennell, TMaitra, R Design and synthesis of cannabinoid receptor 1 antagonists for peripheral selectivity. J Med Chem55:2820-34 (2012) 
 
Cannabinoid receptor 2
Name:Cannabinoid receptor 2
Type:G Protein-Coupled Receptor (GPCR)
Mol. Mass.:39690.94
Organism:Homo sapiens (Human)
Description:P34972
Residue:360
BDBM50383395
NameBDBM50383395
Synonyms:CHEMBL2030747
TypeSmall organic molecule
Emp. Form.C37H35Cl3N6O2
Mol. Mass.702.072
SMILESCN(C)c1ccc(NC(=O)NC2(CCN(CC2)C(=O)c2nn(c(c2C)-c2ccc(Cl)cc2)-c2ccc(Cl)cc2Cl)c2ccccc2)cc1