Reaction Details
TargetCannabinoid receptor 2
LigandBDBM50383396
Substrate/Competitorn/a
Meas. Tech.ChEMBL_818078 (CHEMBL2033720)
Ki 2414±n/a nM
Citation Fulp, ABortoff, KSeltzman, HZhang, YMathews, JSnyder, RFennell, TMaitra, R Design and synthesis of cannabinoid receptor 1 antagonists for peripheral selectivity. J Med Chem55:2820-34 (2012) 
 
Cannabinoid receptor 2
Name:Cannabinoid receptor 2
Type:G Protein-Coupled Receptor (GPCR)
Mol. Mass.:39690.94
Organism:Homo sapiens (Human)
Description:P34972
Residue:360
BDBM50383396
NameBDBM50383396
Synonyms:CHEMBL2030748
TypeSmall organic molecule
Emp. Form.C35H38Cl3N5O2
Mol. Mass.667.068
SMILESCCCCCCNC(=O)NC1(CCN(CC1)C(=O)c1nn(c(c1C)-c1ccc(Cl)cc1)-c1ccc(Cl)cc1Cl)c1ccccc1