Reaction Details
TargetCannabinoid receptor 2
LigandBDBM50383411
Substrate/Competitorn/a
Meas. Tech.ChEMBL_818078 (CHEMBL2033720)
Ki 5420±n/a nM
Citation Fulp, ABortoff, KSeltzman, HZhang, YMathews, JSnyder, RFennell, TMaitra, R Design and synthesis of cannabinoid receptor 1 antagonists for peripheral selectivity. J Med Chem55:2820-34 (2012) 
 
Cannabinoid receptor 2
Name:Cannabinoid receptor 2
Type:G Protein-Coupled Receptor (GPCR)
Mol. Mass.:39690.94
Organism:Homo sapiens (Human)
Description:P34972
Residue:360
BDBM50383411
NameBDBM50383411
Synonyms:CHEMBL2030929
TypeSmall organic molecule
Emp. Form.C25H25Cl3N4O3
Mol. Mass.535.85
SMILESCCOC(=O)N1CCC[C@@H](C1)NC(=O)c1nn(c(c1C)-c1ccc(Cl)cc1)-c1ccc(Cl)cc1Cl