Reaction Details
TargetCannabinoid receptor 2
LigandBDBM50383416
Substrate/Competitorn/a
Meas. Tech.ChEMBL_818078 (CHEMBL2033720)
Ki 3031±n/a nM
Citation Fulp, ABortoff, KSeltzman, HZhang, YMathews, JSnyder, RFennell, TMaitra, R Design and synthesis of cannabinoid receptor 1 antagonists for peripheral selectivity. J Med Chem55:2820-34 (2012) 
 
Cannabinoid receptor 2
Name:Cannabinoid receptor 2
Type:G Protein-Coupled Receptor (GPCR)
Mol. Mass.:39690.94
Organism:Homo sapiens (Human)
Description:P34972
Residue:360
BDBM50383416
NameBDBM50383416
Synonyms:CHEMBL2030937
TypeSmall organic molecule
Emp. Form.C27H30Cl3N5O2
Mol. Mass.562.918
SMILESCCCCNC(=O)N1CCC[C@H](C1)NC(=O)c1nn(c(c1C)-c1ccc(Cl)cc1)-c1ccc(Cl)cc1Cl