Reaction Details
TargetSolute carrier family 12 member 5
LigandBDBM50384301
Substrate/Competitorn/a
Meas. Tech.ChEMBL_818163 (CHEMBL2033940)
IC50 300±n/a nM
Citation Lebon, FPégurier, CLedecq, MMathieu, BBosman, NFrycia, ALengelé, SDhurke, KKanduluru, AKMeunier, SWagner, AWolff, CProvins, L Towards a KCC2 blocker pharmacophore model. Bioorg Med Chem Lett22:3978-82 (2012) 
 
Solute carrier family 12 member 5
Name:Solute carrier family 12 member 5
Type:PROTEIN
Mol. Mass.:126249.28
Organism:Rattus norvegicus
Description:ChEMBL_818163
Residue:1139
BDBM50384301
NameBDBM50384301
Synonyms:CHEMBL2030662
TypeSmall organic molecule
Emp. Form.C22H25NO2
Mol. Mass.335.4394
SMILESCC(=O)N1CCCC1(Cc1ccccc1)C(=O)CCc1ccccc1