Reaction Details
TargetReceptor-type tyrosine-protein kinase FLT3
LigandBDBM50384721
Substrate/Competitorn/a
Meas. Tech.ChEMBL_820932 (CHEMBL2038873)
IC50 2100±n/a nM
Citation Albaugh, PFan, YMi, YSun, FAdrian, FLi, NJia, YSarkisova, YKreusch, AHood, TLu, MLiu, GHuang, SLiu, ZLoren, JTuntland, TKaranewsky, DSSeidel, HMMolteni, V Discovery of GNF-5837, a Selective TRK Inhibitor with Efficacy in Rodent Cancer Tumor Models. ACS Med Chem Lett3:140-145 (2012) 
 
Receptor-type tyrosine-protein kinase FLT3
Name:Receptor-type tyrosine-protein kinase FLT3
Type:PROTEIN
Mol. Mass.:113492.59
Organism:Mus musculus
Description:ChEMBL_104536
Residue:1000
BDBM50384721
NameBDBM50384721
Synonyms:CHEMBL2037224
TypeSmall organic molecule
Emp. Form.C27H20F3N5O2
Mol. Mass.503.4752
SMILESFC(F)(F)c1cccc(NC(=O)Nc2cccc(Nc3ccc4\C(=C\c5ccc[nH]5)C(=O)Nc4c3)c2)c1