Reaction Details
TargetTyrosine-protein kinase Fgr
LigandBDBM50384721
Substrate/Competitorn/a
Meas. Tech.ChEMBL_820930 (CHEMBL2038871)
IC50 2000±n/a nM
Citation Albaugh, PFan, YMi, YSun, FAdrian, FLi, NJia, YSarkisova, YKreusch, AHood, TLu, MLiu, GHuang, SLiu, ZLoren, JTuntland, TKaranewsky, DSSeidel, HMMolteni, V Discovery of GNF-5837, a Selective TRK Inhibitor with Efficacy in Rodent Cancer Tumor Models. ACS Med Chem Lett3:140-145 (2012) 
 
Tyrosine-protein kinase Fgr
Name:Tyrosine-protein kinase Fgr
Type:PROTEIN
Mol. Mass.:58854.89
Organism:Mus musculus
Description:ChEMBL_820930
Residue:517
BDBM50384721
NameBDBM50384721
Synonyms:CHEMBL2037224
TypeSmall organic molecule
Emp. Form.C27H20F3N5O2
Mol. Mass.503.4752
SMILESFC(F)(F)c1cccc(NC(=O)Nc2cccc(Nc3ccc4\C(=C\c5ccc[nH]5)C(=O)Nc4c3)c2)c1