Reaction Details
TargetBDNF/NT-3 growth factors receptor
LigandBDBM50384727
Substrate/Competitorn/a
Meas. Tech.ChEMBL_820920 (CHEMBL2038861)
IC50 12±n/a nM
Citation Albaugh, PFan, YMi, YSun, FAdrian, FLi, NJia, YSarkisova, YKreusch, AHood, TLu, MLiu, GHuang, SLiu, ZLoren, JTuntland, TKaranewsky, DSSeidel, HMMolteni, V Discovery of GNF-5837, a Selective TRK Inhibitor with Efficacy in Rodent Cancer Tumor Models. ACS Med Chem Lett3:140-145 (2012) 
 
BDNF/NT-3 growth factors receptor
Name:BDNF/NT-3 growth factors receptor
Type:Enzyme
Mol. Mass.:91996.87
Organism:Homo sapiens (Human)
Description:Q16620
Residue:822
BDBM50384727
NameBDBM50384727
Synonyms:CHEMBL2037226
TypeSmall organic molecule
Emp. Form.C28H21F4N5O2
Mol. Mass.535.4923
SMILESCc1ccc(NC(=O)Nc2cc(ccc2F)C(F)(F)F)cc1Nc1ccc2\C(=C\c3ccc[nH]3)C(=O)Nc2c1