Reaction Details
TargetG-protein coupled receptor 35
LigandBDBM50384789
Substrate/Competitorn/a
Meas. Tech.ChEMBL_821049 (CHEMBL2039375)
IC50 390±n/a nM
Citation Deng, HHu, HLing, SFerrie, AMFang, Y Discovery of Natural Phenols as G Protein-Coupled Receptor-35 (GPR35) Agonists. ACS Med Chem Lett3:165-169 (2012) 
 
G-protein coupled receptor 35
Name:G-protein coupled receptor 35
Type:Enzyme Catalytic Domain
Mol. Mass.:34085.57
Organism:Homo sapiens (Human)
Description:gi_33695097
Residue:309
BDBM50384789
NameBDBM50384789
Synonyms:CHEMBL2037378 | Laccaic acid A (LCA)
TypeSmall organic molecule
Emp. Form.C26H19NO12
Mol. Mass.537.4286
SMILESCC(=O)NCCc1ccc(O)c(c1)-c1c(O)c(O)c2C(=O)c3cc(O)c(C(O)=O)c(C(O)=O)c3C(=O)c2c1O