Reaction Details
TargetEpidermal growth factor receptor
LigandBDBM50384888
Substrate/Competitorn/a
Meas. Tech.ChEMBL_821720 (CHEMBL2038916)
IC50 3.3±n/a nM
Citation Cha, MYLee, KOKang, SJJung, YHSong, JYChoi, KJByun, JYLee, HJLee, GSPark, SBKim, MS Synthesis and biological evaluation of pyrimidine-based dual inhibitors of human epidermal growth factor receptor 1 (HER-1) and HER-2 tyrosine kinases. J Med Chem55:2846-57 (2012) 
 
Epidermal growth factor receptor
Name:Epidermal growth factor receptor
Type:Receptor Kinase Domain
Mol. Mass.:134279.59
Organism:Homo sapiens (Human)
Description:P00533
Residue:1210
BDBM50384888
NameBDBM50384888
Synonyms:CHEMBL2035810
TypeSmall organic molecule
Emp. Form.C23H20ClN7O3
Mol. Mass.477.903
SMILESNc1ncnc(Nc2ccc(OCc3ccccn3)c(Cl)c2)c1-c1nc(CNC(=O)C=C)co1