Reaction Details
TargetCholinesterase
LigandBDBM50384894
Substrate/Competitorn/a
Meas. Tech.ChEMBL_820326 (CHEMBL2037748)
IC50 91.2±n/a nM
Citation Wang, YGuan, XLWu, PFWang, CMCao, HLi, LGuo, XJWang, FXie, NJiang, FCChen, JG Multifunctional mercapto-tacrine derivatives for treatment of age-related neurodegenerative diseases. J Med Chem55:3588-92 (2012) 
 
Cholinesterase
Name:Cholinesterase
Type:Enzyme
Mol. Mass.:65643.35
Organism:Equus caballus (Horse)
Description:P81908
Residue:574
BDBM50384894
NameBDBM50384894
Synonyms:CHEMBL2036262
TypeSmall organic molecule
Emp. Form.C24H32ClN3O2S
Mol. Mass.462.048
SMILESCC(=O)SCCC(=O)NCCCCCCNc1c2CCCCc2nc2cc(Cl)ccc12