Reaction Details
TargetHistone deacetylase 8
LigandBDBM19410
Substrate/Competitorn/a
Meas. Tech.ChEMBL_821470 (CHEMBL2038000)
IC50 63400±n/a nM
Citation Rajak, HKumar, PParmar, PThakur, BSVeerasamy, RSharma, PCSharma, AKGupta, AKDangi, JS Appraisal of GABA and PABA as linker: design and synthesis of novel benzamide based histone deacetylase inhibitors. Eur J Med Chem53:390-7 (2012) 
 
Histone deacetylase 8
Name:Histone deacetylase 8
Type:Enzyme
Mol. Mass.:41749.60
Organism:Homo sapiens (Human)
Description:Q9BY41
Residue:377
BDBM19410
NameBDBM19410
Synonyms:CHEMBL27759 US11377423, MS-275 US9265734, MS-275 benzamide-type inhibitor, 3 | pyridin-3-ylmethyl N-({4-[(2-aminophenyl)carbamoyl]phenyl}methyl)carbamate
TypeSmall organic molecule
Emp. Form.C21H20N4O3
Mol. Mass.376.4085
SMILESNc1ccccc1NC(=O)c1ccc(CNC(=O)OCc2cccnc2)cc1