Reaction Details
TargetC-X-C chemokine receptor type 4
LigandBDBM50385613
Substrate/Competitorn/a
Meas. Tech.ChEMBL_825943 (CHEMBL2044967)
IC50 4.9±n/a nM
Citation Inokuchi, EOishi, SKubo, TOhno, HShimura, KMatsuoka, MFujii, N Potent CXCR4 antagonists containing amidine type Peptide bond isosteres. ACS Med Chem Lett2:477-480 (2011) 
 
C-X-C chemokine receptor type 4
Name:C-X-C chemokine receptor type 4
Type:Enzyme
Mol. Mass.:39754.61
Organism:Homo sapiens (Human)
Description:P61073
Residue:352
BDBM50385613
NameBDBM50385613
Synonyms:CHEMBL2042119
TypeSmall organic molecule
Emp. Form.C36H48N12O5
Mol. Mass.728.8437
SMILES[#7]\[#6](-[#7])=[#7]\[#6]-[#6]-[#6]-[#6@@H]-1-[#7]-[#6](=O)-[#6@H](-[#6]-[#6]-[#6]\[#7]=[#6](\[#7])-[#7])-[#7]-[#6](=O)-[#6@@H](-[#6]-c2ccc(-[#8])cc2)-[#7]-[#6](=O)-[#6]-[#7]=[#6](-[#7])-[#6@@H](-[#6]-c2ccc3ccccc3c2)-[#7]-[#6]-1=O