Reaction Details
TargetFarnesyl pyrophosphate synthase
LigandBDBM50386557
Substrate/Competitorn/a
Meas. Tech.ChEMBL_826197 (CHEMBL2049638)
IC50 35±n/a nM
Citation Lin, YSPark, JDe Schutter, JWHuang, XFBerghuis, AMSebag, MTsantrizos, YS Design and synthesis of active site inhibitors of the human farnesyl pyrophosphate synthase: apoptosis and inhibition of ERK phosphorylation in multiple myeloma cells. J Med Chem55:3201-15 (2012) 
 
Farnesyl pyrophosphate synthase
Name:Farnesyl pyrophosphate synthase
Type:Enzyme
Mol. Mass.:48272.89
Organism:Homo sapiens (Human)
Description:P14324
Residue:419
BDBM50386557
NameBDBM50386557
Synonyms:CHEMBL2048243
TypeSmall organic molecule
Emp. Form.C13H16N2O6P2
Mol. Mass.358.2235
SMILESCc1ccc(cc1)-c1ccnc(NC(P(O)(O)=O)P(O)(O)=O)c1