Reaction Details
TargetFarnesyl pyrophosphate synthase
LigandBDBM50386556
Substrate/Competitorn/a
Meas. Tech.ChEMBL_826199 (CHEMBL2049640)
IC50 2090±n/a nM
Citation Lin, YSPark, JDe Schutter, JWHuang, XFBerghuis, AMSebag, MTsantrizos, YS Design and synthesis of active site inhibitors of the human farnesyl pyrophosphate synthase: apoptosis and inhibition of ERK phosphorylation in multiple myeloma cells. J Med Chem55:3201-15 (2012) 
 
Farnesyl pyrophosphate synthase
Name:Farnesyl pyrophosphate synthase
Type:Enzyme
Mol. Mass.:48272.89
Organism:Homo sapiens (Human)
Description:P14324
Residue:419
BDBM50386556
NameBDBM50386556
Synonyms:CHEMBL2048242
TypeSmall organic molecule
Emp. Form.C16H20N2O7P2
Mol. Mass.414.2867
SMILESOP(O)(=O)C(Nc1cc(ccn1)-c1ccc(OC2CCC2)cc1)P(O)(O)=O