Reaction Details
TargetFarnesyl pyrophosphate synthase
LigandBDBM12576
Substrate/Competitorn/a
Meas. Tech.ChEMBL_826199 (CHEMBL2049640)
IC50 860±n/a nM
Citation Lin, YSPark, JDe Schutter, JWHuang, XFBerghuis, AMSebag, MTsantrizos, YS Design and synthesis of active site inhibitors of the human farnesyl pyrophosphate synthase: apoptosis and inhibition of ERK phosphorylation in multiple myeloma cells. J Med Chem55:3201-15 (2012) 
 
Farnesyl pyrophosphate synthase
Name:Farnesyl pyrophosphate synthase
Type:Enzyme
Mol. Mass.:48272.89
Organism:Homo sapiens (Human)
Description:P14324
Residue:419
BDBM12576
NameBDBM12576
Synonyms:Bisphosphonate 1 JMC515594 Compound 64 Risdronate [1-hydroxy-1-phosphono-2-(pyridin-3-yl)ethyl]phosphonic acid
TypeSmall organic molecule
Emp. Form.C7H11NO7P2
Mol. Mass.283.1123
SMILESOC(Cc1cccnc1)(P(O)(O)=O)P(O)(O)=O