Reaction Details
TargetSodium/glucose cotransporter 2
LigandBDBM50386889
Substrate/Competitorn/a
Meas. Tech.ChEMBL_827406 (CHEMBL2051076)
IC50 9.9±n/a nM
Citation Ohtake, YSato, TMatsuoka, HKobayashi, TNishimoto, MTaka, NTakano, KYamamoto, KOhmori, MHiguchi, TMurakata, MMorikawa, KShimma, NSuzuki, MHagita, HOzawa, KYamaguchi, KKato, MIkeda, S C-Aryl 5a-carba-ß-d-glucopyranosides as novel sodium glucose cotransporter 2 (SGLT2) inhibitors for the treatment of type 2 diabetes. Bioorg Med Chem20:4117-27 (2012) 
 
Sodium/glucose cotransporter 2
Name:Sodium/glucose cotransporter 2
Type:Protein
Mol. Mass.:72902.00
Organism:Homo sapiens (Human)
Description:P31639
Residue:672
BDBM50386889
NameBDBM50386889
Synonyms:CHEMBL2048493
TypeSmall organic molecule
Emp. Form.C24H32O6
Mol. Mass.416.5073
SMILESCCOc1ccc(Cc2ccc(CC)cc2)cc1[C@]1(O)C[C@H](CO)[C@@H](O)[C@H](O)[C@H]1O