Reaction Details
TargetSodium/glucose cotransporter 2
LigandBDBM50386890
Substrate/Competitorn/a
Meas. Tech.ChEMBL_827406 (CHEMBL2051076)
IC50 52±n/a nM
Citation Ohtake, YSato, TMatsuoka, HKobayashi, TNishimoto, MTaka, NTakano, KYamamoto, KOhmori, MHiguchi, TMurakata, MMorikawa, KShimma, NSuzuki, MHagita, HOzawa, KYamaguchi, KKato, MIkeda, S C-Aryl 5a-carba-ß-d-glucopyranosides as novel sodium glucose cotransporter 2 (SGLT2) inhibitors for the treatment of type 2 diabetes. Bioorg Med Chem20:4117-27 (2012) 
 
Sodium/glucose cotransporter 2
Name:Sodium/glucose cotransporter 2
Type:Protein
Mol. Mass.:72902.00
Organism:Homo sapiens (Human)
Description:P31639
Residue:672
BDBM50386890
NameBDBM50386890
Synonyms:CHEMBL2048494
TypeSmall organic molecule
Emp. Form.C23H30O4
Mol. Mass.370.4819
SMILESCCc1ccc(Cc2ccc(C)c(c2)[C@@H]2C[C@H](CO)[C@@H](O)[C@H](O)[C@H]2O)cc1